View Issue Details Jump to Notes ] Issue History ] Print ]
IDProjectCategoryView StatusDate SubmittedLast Update
0001464aMuleMiscpublic2008-12-30 16:282009-01-01 20:45
ReporterDaniel_J 
Assigned ToGonoszTopi 
PrioritynormalSeverityminorReproducibilityalways
StatusresolvedResolutionfixed 
PlatformOSOS Version
Product Version2.2.3 
Target VersionFixed in VersionSVN 
Summary0001464: aMule 2.2.3 won't build with GCC 4.4 [patch attached]
DescriptionGCC 4.4 (currently in prerelease) is very picky about explicitly including standard library headers. aMule 2.2.3 fails to build on GCC 4.4 with the following message:

Compiling Format.cpp
Format.cpp: In member function 'CFormat& CFormat::operator%(void*)':
Format.cpp:432: error: 'uintptr_t' was not declared in this scope
Format.cpp:434: error: 'uintptr_t' was not declared in this scope
make[4]: *** [Format.o] Error 1

The attached patch fixes this.
TagsNo tags attached.
Fixed in Revision
Operating SystemLinux
Attached Filespatch file icon amule-2.2.3-gcc-4.4.patch [^] (249 bytes) 2008-12-30 16:28 [Show Content]

- Relationships

-  Notes
(0003029)
sturedman (developer)
2009-01-01 14:26

Patch applied in 9309, thanks for reporting!

- Issue History
Date Modified Username Field Change
2008-12-30 16:28 Daniel_J New Issue
2008-12-30 16:28 Daniel_J File Added: amule-2.2.3-gcc-4.4.patch
2008-12-30 16:28 Daniel_J Operating System => Linux
2009-01-01 14:26 sturedman Note Added: 0003029
2009-01-01 14:26 sturedman Assigned To => GonoszTopi
2009-01-01 14:26 sturedman Status new => closed
2009-01-01 14:26 sturedman Resolution open => fixed
2009-01-01 20:45 sturedman Status closed => resolved
2009-01-01 20:45 sturedman Fixed in Version => SVN


Copyright © 2000 - 2019 MantisBT Team
Powered by Mantis Bugtracker